Target
Potassium voltage-gated channel subfamily H member 2
Ligand
BDBM50381980
Substrate
Meas. Tech.
ChEMBL_815108 (CHEMBL2024833)
IC50
16982.44±n/a nM
Citation
 Skidmore, JAtcha, ZBoucherat, ECastelletti, LChen, DWCoppo, FTCutler, LDunsdon, RMHeath, BMHutchings, RHurst, DNJaved, SMartin, SMaskell, ESNorton, DPemberton, DJRedshaw, SRutter, RSehmi, SSScoccitti, TTemple, HETheobald, PWard, RWWilson, DM Identification of a series of 1,3,4-oxadiazol-2-amines as potent alpha-7 agonists with efficacy in the novel object recognition model of cognition. Bioorg Med Chem Lett 22:3560-3 (2012)  
Target
Name:
Potassium voltage-gated channel subfamily H member 2
Synonyms:
1,3-beta-glucan synthase component GLS2 ERG Eag-related protein 1 Ether-a-go-go-related gene (HERG) Ether-a-go-go-related gene potassium channel 1 Ether-a-go-go-related gene potassium channel 1 (hERG1) Ether-a-go-go-related protein 1 H-ERG KCNH2 Potassium voltage-gated channel subfamily H member 2 (hERG) Voltage-gated potassium channel subunit Kv11.1 hERG Potassium Channel 1 | putative potassium channel subunit
Type:
Multi-pass membrane protein
Mol. Mass.:
126672.65
Organism:
Homo sapiens (Human)
Description:
Q12809
Residue:
1159
  
Inhibitor
Name:
BDBM50381980
Synonyms:
CHEMBL2022495
Type:
Small organic molecule
Emp. Form.:
C24H28FN5O3
Mol. Mass.:
453.5092
SMILES:
COc1cc(NC(=O)c2ccccc2F)ccc1-c1nnc(NCCCN2CCCCC2)o1
: