Target
Acetylcholine receptor subunit alpha
Ligand
BDBM50382048
Substrate
Meas. Tech.
ChEMBL_815374 (CHEMBL2026878)
IC50
6309.57±n/a nM
Citation
 Skidmore, JAtcha, ZBoucherat, ECastelletti, LChen, DWCoppo, FTCutler, LDunsdon, RMHeath, BMHutchings, RHurst, DNJaved, SMartin, SMaskell, ESNorton, DPemberton, DJRedshaw, SRutter, RSehmi, SSScoccitti, TTemple, HETheobald, PWard, RWWilson, DM The discovery of 2-fluoro-N-(3-fluoro-4-(5-((4-morpholinobutyl)amino)-1,3,4-oxadiazol-2-yl)phenyl)benzamide, a full agonist of the alpha-7 nicotinic acetylcholine receptor showing efficacy in the novel object recognition model of cognition enhancement. Bioorg Med Chem Lett 22:3531-4 (2012)  
Target
Name:
Acetylcholine receptor subunit alpha
Synonyms:
ACHA_HUMAN Acetylcholine receptor protein alpha chain CHNRA Cholinergic, Nicotinic Alpha1Beta1DeltaGamma Nicotinic acetylcholine receptor alpha-1/beta-1 Nicotinic acetylcholine receptor alpha2/beta4 n-AChR
Type:
Ion channel
Mol. Mass.:
54542.01
Organism:
Homo sapiens (Human)
Description:
Residue:
482
  
Inhibitor
Name:
BDBM50382048
Synonyms:
CHEMBL2022739
Type:
Small organic molecule
Emp. Form.:
C23H25F2N5O3
Mol. Mass.:
457.4731
SMILES:
Fc1ccccc1C(=O)Nc1ccc(-c2nnc(NCCCCN3CCOCC3)o2)c(F)c1
: