Target
Neuronal acetylcholine receptor subunit alpha-7
Ligand
BDBM50382043
Substrate
Meas. Tech.
ChEMBL_815354 (CHEMBL2026858)
EC50
31.62±n/a nM
Citation
 Skidmore, JAtcha, ZBoucherat, ECastelletti, LChen, DWCoppo, FTCutler, LDunsdon, RMHeath, BMHutchings, RHurst, DNJaved, SMartin, SMaskell, ESNorton, DPemberton, DJRedshaw, SRutter, RSehmi, SSScoccitti, TTemple, HETheobald, PWard, RWWilson, DM The discovery of 2-fluoro-N-(3-fluoro-4-(5-((4-morpholinobutyl)amino)-1,3,4-oxadiazol-2-yl)phenyl)benzamide, a full agonist of the alpha-7 nicotinic acetylcholine receptor showing efficacy in the novel object recognition model of cognition enhancement. Bioorg Med Chem Lett 22:3531-4 (2012)  
Target
Name:
Neuronal acetylcholine receptor subunit alpha-7
Synonyms:
ACHA7_HUMAN Cholinergic, Nicotinic Alpha7 Neuronal acetylcholine receptor protein alpha-7 subunit Nicotinic acetylcholine receptor alpha-7 (alpha7 nAChR)
Type:
Mol. Mass.:
56448.33
Organism:
Homo sapiens (Human)
Description:
CHRNA7 (NACHRA7)
Residue:
502
  
Inhibitor
Name:
BDBM50382043
Synonyms:
CHEMBL2022733
Type:
Small organic molecule
Emp. Form.:
C24H28FN5O2
Mol. Mass.:
437.5098
SMILES:
Fc1ccccc1C(=O)Nc1ccc(cc1)-c1nnc(NCCCCN2CCCCC2)o1
: