Target
D(3) dopamine receptor
Ligand
BDBM50382311
Substrate
Meas. Tech.
ChEMBL_816863 (CHEMBL2026134)
Ki
3.3±n/a nM
Citation
 Agai-Csongor, EDomány, GNógrádi, KGalambos, JVágó, IKeseru, GMGreiner, ILaszlovszky, IGere, ASchmidt, EKiss, BVastag, MTihanyi, KSághy, KLaszy, JGyertyán, IZájer-Balázs, MGémesi, LKapás, MSzombathelyi, Z Discovery of cariprazine (RGH-188): a novel antipsychotic acting on dopamine D3/D2 receptors. Bioorg Med Chem Lett 22:3437-40 (2012)  
Target
Name:
D(3) dopamine receptor
Synonyms:
DOPAMINE D3 Dopamine D3 receptor | Drd3
Type:
Protein
Mol. Mass.:
49540.58
Organism:
Rattus norvegicus (Rat)
Description:
P19020
Residue:
446
  
Inhibitor
Name:
BDBM50382311
Synonyms:
CHEMBL2024676
Type:
Small organic molecule
Emp. Form.:
C21H32Cl2N4O
Mol. Mass.:
427.411
SMILES:
CN(C)C(=O)N[C@H]1CC[C@H](CCN2CCN(CC2)c2ccc(Cl)c(Cl)c2)CC1
: