Target
D(2) dopamine receptor
Ligand
BDBM50382291
Substrate
Meas. Tech.
ChEMBL_816864 (CHEMBL2026135)
IC50
143±n/a nM
Citation
 Agai-Csongor, EDomány, GNógrádi, KGalambos, JVágó, IKeseru, GMGreiner, ILaszlovszky, IGere, ASchmidt, EKiss, BVastag, MTihanyi, KSághy, KLaszy, JGyertyán, IZájer-Balázs, MGémesi, LKapás, MSzombathelyi, Z Discovery of cariprazine (RGH-188): a novel antipsychotic acting on dopamine D3/D2 receptors. Bioorg Med Chem Lett 22:3437-40 (2012)  
Target
Name:
D(2) dopamine receptor
Synonyms:
DOPAMINE D2 DOPAMINE D2 Short Dopamine D2 receptor Drd2
Type:
G Protein-Coupled Receptor (GPCR)
Mol. Mass.:
50931.60
Organism:
Rattus norvegicus (rat)
Description:
P61169
Residue:
444
  
Inhibitor
Name:
BDBM50382291
Synonyms:
CHEMBL2024508
Type:
Small organic molecule
Emp. Form.:
C22H29F3N4O
Mol. Mass.:
422.4871
SMILES:
CC(=O)N[C@H]1CC[C@H](CCN2CCN(CC2)c2cc(cc(c2)C(F)(F)F)C#N)CC1
: