Target
D(2) dopamine receptor
Ligand
BDBM50382290
Substrate
Meas. Tech.
ChEMBL_816864 (CHEMBL2026135)
IC50
16±n/a nM
Citation
 Agai-Csongor, EDomány, GNógrádi, KGalambos, JVágó, IKeseru, GMGreiner, ILaszlovszky, IGere, ASchmidt, EKiss, BVastag, MTihanyi, KSághy, KLaszy, JGyertyán, IZájer-Balázs, MGémesi, LKapás, MSzombathelyi, Z Discovery of cariprazine (RGH-188): a novel antipsychotic acting on dopamine D3/D2 receptors. Bioorg Med Chem Lett 22:3437-40 (2012)  
Target
Name:
D(2) dopamine receptor
Synonyms:
DOPAMINE D2 DOPAMINE D2 Short Dopamine D2 receptor Drd2
Type:
G Protein-Coupled Receptor (GPCR)
Mol. Mass.:
50931.60
Organism:
Rattus norvegicus (rat)
Description:
P61169
Residue:
444
  
Inhibitor
Name:
BDBM50382290
Synonyms:
CARIPRAZINE HYDROCHLORIDE | RGH-188 HCL
Type:
Small organic molecule
Emp. Form.:
C21H32Cl2N4O
Mol. Mass.:
427.411
SMILES:
CN(C)C(=O)N[C@H]1CC[C@H](CCN2CCN(CC2)c2cccc(Cl)c2Cl)CC1
: