Target
TGF-beta receptor type-1
Ligand
BDBM50382319
Substrate
Meas. Tech.
ChEMBL_815895 (CHEMBL2026330)
IC50
4±n/a nM
Citation
 Boys, MLBian, FKramer, JBChio, CLRen, XDChen, HBarrett, SDSexton, KEIula, DMFilzen, GFNguyen, MNAngell, PDowns, VLWang, ZRaheja, NEllsworth, ELFakhoury, SBratton, LDKeller, PRGowan, RDrummond, EMMaiti, SNHena, MALu, LMcConnell, PKnafels, JDThanabal, VSun, FAlessi, DMcCarthy, AZhang, EFinzel, BCPatel, SCiotti, SMEisma, RPayne, NAGilbertsen, RBKostlan, CRPocalyko, DJLala, DS Discovery of a series of 2-(1H-pyrazol-1-yl)pyridines as ALK5 inhibitors with potential utility in the prevention of dermal scarring. Bioorg Med Chem Lett 22:3392-7 (2012)  
Target
Name:
TGF-beta receptor type-1
Synonyms:
ALK-5 Activin A receptor type II-like protein kinase of 53kD SKR4 TGF-beta receptor type I TGFBR1 TGFR1_HUMAN Transforming growth factor-beta receptor type I
Type:
enzyme
Mol. Mass.:
55968.24
Organism:
Homo sapiens (Human)
Description:
P36897
Residue:
503
  
Inhibitor
Name:
BDBM50382319
Synonyms:
CHEMBL2024686
Type:
Small organic molecule
Emp. Form.:
C19H17N5O
Mol. Mass.:
331.3712
SMILES:
Cc1cnn(c1-c1ccc2ncn(C)c(=O)c2c1)-c1cccc(C)n1
: