Target
1,4-dihydroxy-2-naphthoyl-CoA synthase
Ligand
BDBM50382353
Substrate
Meas. Tech.
ChEMBL_817596 (CHEMBL2027819)
IC50
33500±n/a nM
Citation
 Li, XLiu, NZhang, HKnudson, SELi, HJLai, CTSimmerling, CSlayden, RATonge, PJ CoA Adducts of 4-Oxo-4-Phenylbut-2-enoates: Inhibitors of MenB from the M. tuberculosis Menaquinone Biosynthesis Pathway. ACS Med Chem Lett 2:818-823 (2011)  
Target
Name:
1,4-dihydroxy-2-naphthoyl-CoA synthase
Synonyms:
DHNA-CoA synthase menB
Type:
PROTEIN
Mol. Mass.:
34688.06
Organism:
Mycobacterium tuberculosis
Description:
ChEMBL_817596
Residue:
314
  
Inhibitor
Name:
BDBM50382353
Synonyms:
CHEMBL2024336
Type:
Small organic molecule
Emp. Form.:
C32H46N7O20P3S
Mol. Mass.:
973.729
SMILES:
COc1ccc(cc1)C(=O)CC(SCCNC(=O)CCNC(=O)[C@H](O)C(C)(C)COP(O)(=O)OP(O)(=O)OC[C@H]1O[C@H]([C@H](O)[C@@H]1OP(O)(O)=O)n1cnc2c(N)ncnc12)C(O)=O
: