Target
1,4-dihydroxy-2-naphthoyl-CoA synthase
Ligand
BDBM50382354
Substrate
Meas. Tech.
ChEMBL_817596 (CHEMBL2027819)
IC50
>120000±n/a nM
Citation
 Li, XLiu, NZhang, HKnudson, SELi, HJLai, CTSimmerling, CSlayden, RATonge, PJ CoA Adducts of 4-Oxo-4-Phenylbut-2-enoates: Inhibitors of MenB from the M. tuberculosis Menaquinone Biosynthesis Pathway. ACS Med Chem Lett 2:818-823 (2011)  
Target
Name:
1,4-dihydroxy-2-naphthoyl-CoA synthase
Synonyms:
DHNA-CoA synthase menB
Type:
PROTEIN
Mol. Mass.:
34688.06
Organism:
Mycobacterium tuberculosis
Description:
ChEMBL_817596
Residue:
314
  
Inhibitor
Name:
BDBM50382354
Synonyms:
CHEMBL2024253
Type:
Small organic molecule
Emp. Form.:
C18H19NO3
Mol. Mass.:
297.3484
SMILES:
C[C@H](NC(CC(=O)c1ccccc1)C(O)=O)c1ccccc1
: