Target
Tyrosine-protein kinase receptor UFO
Ligand
BDBM50382441
Substrate
Meas. Tech.
ChEMBL_815463 (CHEMBL2027231)
IC50
14±n/a nM
Citation
 Mollard, AWarner, SLCall, LTWade, MLBearss, JJVerma, ASharma, SVankayalapati, HBearss, DJ Design, Synthesis and Biological Evaluation of a Series of Novel Axl Kinase Inhibitors. ACS Med Chem Lett 2:907-912 (2011)  
Target
Name:
Tyrosine-protein kinase receptor UFO
Synonyms:
AXL TEL/AXL UFO | UFO_HUMAN
Type:
Enzyme
Mol. Mass.:
98316.97
Organism:
Homo sapiens (Human)
Description:
P30530
Residue:
894
  
Inhibitor
Name:
BDBM50382441
Synonyms:
CHEMBL2023349
Type:
Small organic molecule
Emp. Form.:
C30H34N8
Mol. Mass.:
506.6446
SMILES:
Nc1nc(Nc2ccc3CCC(CCc3c2)N2CCCC2)nn1-c1cc2CCCc3ccccc3-c2nn1
: