Target
Tyrosine-protein kinase receptor UFO
Ligand
BDBM50382442
Substrate
Meas. Tech.
ChEMBL_815463 (CHEMBL2027231)
IC50
30±n/a nM
Citation
 Mollard, AWarner, SLCall, LTWade, MLBearss, JJVerma, ASharma, SVankayalapati, HBearss, DJ Design, Synthesis and Biological Evaluation of a Series of Novel Axl Kinase Inhibitors. ACS Med Chem Lett 2:907-912 (2011)  
Target
Name:
Tyrosine-protein kinase receptor UFO
Synonyms:
AXL TEL/AXL UFO | UFO_HUMAN
Type:
Enzyme
Mol. Mass.:
98316.97
Organism:
Homo sapiens (Human)
Description:
P30530
Residue:
894
  
Inhibitor
Name:
BDBM50382442
Synonyms:
CHEMBL2023350
Type:
Small organic molecule
Emp. Form.:
C22H24N6O
Mol. Mass.:
388.4656
SMILES:
CN1CCC(CC1)n1cc(c(C)n1)-c1cnc(N)c(c1)-c1nc2ccccc2o1
: