Target
Signal transducer and activator of transcription 3
Ligand
BDBM50382464
Substrate
Meas. Tech.
ChEMBL_815757 (CHEMBL2025841)
Ki
>25000±n/a nM
Citation
 Page, BDKhoury, HLaister, RCFletcher, SVellozo, MManzoli, AYue, PTurkson, JMinden, MDGunning, PT Small molecule STAT5-SH2 domain inhibitors exhibit potent antileukemia activity. J Med Chem 55:1047-55 (2012)  
Target
Name:
Signal transducer and activator of transcription 3
Synonyms:
APRF STAT3_HUMAN Signal transducer and activator of transcription 3 (STAT3)
Type:
Protein
Mol. Mass.:
88064.31
Organism:
Homo sapiens (Human)
Description:
P40763
Residue:
770
  
Inhibitor
Name:
BDBM50382464
Synonyms:
CHEMBL2024086
Type:
Small organic molecule
Emp. Form.:
C28H30N2O8S
Mol. Mass.:
554.611
SMILES:
Cc1ccc(cc1)S(=O)(=O)N(CC(=O)N(Cc1ccccc1)c1ccc(C(O)=O)c(O)c1)C(=O)OC(C)(C)C
: