Target
Signal transducer and activator of transcription 1-alpha/beta
Ligand
BDBM50353435
Substrate
Meas. Tech.
ChEMBL_815759 (CHEMBL2025843)
Ki
22000±n/a nM
Citation
 Page, BDKhoury, HLaister, RCFletcher, SVellozo, MManzoli, AYue, PTurkson, JMinden, MDGunning, PT Small molecule STAT5-SH2 domain inhibitors exhibit potent antileukemia activity. J Med Chem 55:1047-55 (2012)  
Target
Name:
Signal transducer and activator of transcription 1-alpha/beta
Synonyms:
STAT1 Signal transducer and activator of transcription 1-alpha/beta Transcription factor ISGF-3 components p91/p84 | signal transducer and activator of transcription 1 isoform alpha
Type:
Cytosolic Transcription Factor
Mol. Mass.:
87327.69
Organism:
Homo sapiens (Human)
Description:
Stat1 was expressed in sf9 cells from a baculovirus encoding the recombinant proteins. Stat1 dimer binds to DNA.
Residue:
750
  
Inhibitor
Name:
BDBM50353435
Synonyms:
CHEMBL1829874 | US10196373, Compound 45K
Type:
Small organic molecule
Emp. Form.:
C29H31ClN2O6S
Mol. Mass.:
571.084
SMILES:
CN(CC(=O)N(Cc1ccc(cc1)C1CCCCC1)c1ccc(C(O)=O)c(O)c1)S(=O)(=O)c1ccc(Cl)cc1
: