Target
Carbonic anhydrase 2
Ligand
BDBM50382703
Substrate
Meas. Tech.
ChEMBL_817438 (CHEMBL2027661)
Ki
33±n/a nM
Citation
 Carta, FAggarwal, MMaresca, AScozzafava, AMcKenna, RMasini, ESupuran, CT Dithiocarbamates strongly inhibit carbonic anhydrases and show antiglaucoma action in vivo. J Med Chem 55:1721-30 (2012)  
Target
Name:
Carbonic anhydrase 2
Synonyms:
CA-II CAC Carbonate dehydratase II Carbonic anhydrase 2 (CA-II) Carbonic anhydrase C Carbonic anhydrase II (CA-II) Carbonic anhydrase II (hCA II) | Carbonic anhydrase isoenzyme II (hCA II)
Type:
Enzyme
Mol. Mass.:
29250.71
Organism:
Homo sapiens (Human)
Description:
P00918
Residue:
260
  
Inhibitor
Name:
BDBM50382703
Synonyms:
CHEMBL2023164
Type:
Small organic molecule
Emp. Form.:
C6H12N3S2
Mol. Mass.:
190.31
SMILES:
CN1CCN(CC1)NC([S-])=S
: