Target
Carbonic anhydrase 9
Ligand
BDBM50382710
Substrate
Meas. Tech.
ChEMBL_817439 (CHEMBL2027662)
Ki
57±n/a nM
Citation
 Carta, FAggarwal, MMaresca, AScozzafava, AMcKenna, RMasini, ESupuran, CT Dithiocarbamates strongly inhibit carbonic anhydrases and show antiglaucoma action in vivo. J Med Chem 55:1721-30 (2012)  
Target
Name:
Carbonic anhydrase 9
Synonyms:
CA-IX CAH9_HUMAN Carbonic anhydrase 9 (CA IX) Carbonic anhydrase 9 precursor Carbonic anhydrase IX (CAIX) Carbonic anhydrases; II & IX MN RCC-associated antigen G250
Type:
Enzyme
Mol. Mass.:
49669.03
Organism:
Homo sapiens (Human)
Description:
Catalytic domain of human cloned isozyme was used in the assay
Residue:
459
  
Inhibitor
Name:
BDBM50382710
Synonyms:
CHEMBL2023172
Type:
Small organic molecule
Emp. Form.:
C3H3NO2S2
Mol. Mass.:
149.193
SMILES:
[O-]C(=O)CNC([S-])=S
: