Target
Estrogen receptor beta
Ligand
BDBM50382734
Substrate
Meas. Tech.
ChEMBL_815210 (CHEMBL2025227)
IC50
3.1±n/a nM
Citation
 Dadiboyena, S Recent advances in the synthesis of raloxifene: a selective estrogen receptor modulator. Eur J Med Chem 51:17-34 (2012)  
Target
Name:
Estrogen receptor beta
Synonyms:
ER-beta ESR2_HUMAN Estradiol receptor beta (ERβ) Estrogen receptor (ER beta) Estrogen receptor beta (ER beta) NR3A2 estrogen beta
Type:
Protein
Mol. Mass.:
59238.43
Organism:
Homo sapiens (Human)
Description:
Q92731
Residue:
530
  
Inhibitor
Name:
BDBM50382734
Synonyms:
CHEMBL2024376
Type:
Small organic molecule
Emp. Form.:
C28H27NO4S
Mol. Mass.:
473.583
SMILES:
C[C@H]1CCN(CCOc2ccc(cc2)C(=O)c2c(sc3cc(O)ccc23)-c2ccc(O)cc2)C1
: