Target
Lysosomal Pro-X carboxypeptidase
Ligand
BDBM50382886
Substrate
Meas. Tech.
ChEMBL_815279 (CHEMBL2026494)
IC50
0.9±n/a nM
Citation
 Graham, THLiu, WVerras, ASebhat, IKXiong, YBleasby, KBhatt, URChen, QGarcia-Calvo, MGeissler, WMGorski, JNHe, HLassman, MELisnock, JLi, XShen, ZTong, XTung, ECWiltsie, JXiao, JXie, DXu, SHale, JJPinto, SShen, DM A new class of prolylcarboxypeptidase inhibitors, part 1: discovery and evaluation. Bioorg Med Chem Lett 22:2811-7 (2012)  
Target
Name:
Lysosomal Pro-X carboxypeptidase
Synonyms:
Angiotensinase C PCP PRCP Prolylcarboxypeptidase | Prolylcarboxypeptidase (PRCP)
Type:
Enzyme
Mol. Mass.:
55805.19
Organism:
Homo sapiens (Human)
Description:
P42785
Residue:
496
  
Inhibitor
Name:
BDBM50382886
Synonyms:
CHEMBL2024198 | US8569299, 23
Type:
Small organic molecule
Emp. Form.:
C30H36ClF2N5O
Mol. Mass.:
556.09
SMILES:
Cc1nc(C2CCN(CC2)C(=O)[C@@H]2CN(C[C@H]2c2ccc(F)cc2F)C(C)(C)C)n(n1)-c1ccc(Cl)c(C)c1
: