Target
C-C chemokine receptor type 2
Ligand
BDBM50382932
Substrate
Meas. Tech.
ChEMBL_819962 (CHEMBL2032549)
IC50
2.8±n/a nM
Citation
 Xue, CBWang, AHan, QZhang, YCao, GFeng, HHuang, TZheng, CXia, MZhang, KKong, LGlenn, JAnand, RMeloni, DRobinson, DJShao, LStorace, LLi, MHughes, RODevraj, RMorton, PARogier, DJCovington, MScherle, PDiamond, SEmm, TYeleswaram, SContel, NVaddi, KNewton, RHollis, GMetcalf, B Discovery of INCB8761/PF-4136309, a Potent, Selective, and Orally Bioavailable CCR2 Antagonist. ACS Med Chem Lett 2:913-918 (2011)  
Target
Name:
C-C chemokine receptor type 2
Synonyms:
C-C CKR-2 CCR-2 CD_antigen=CD192 Cmkbr2
Type:
PROTEIN
Mol. Mass.:
42771.06
Organism:
Rattus norvegicus
Description:
ChEMBL_819962
Residue:
373
  
Inhibitor
Name:
BDBM50382932
Synonyms:
CHEMBL2029422
Type:
Small organic molecule
Emp. Form.:
C29H31F3N6O3
Mol. Mass.:
568.59
SMILES:
O[C@]1(CC[C@@H](CC1)N[C@H]1CCN(C1)C(=O)CNC(=O)c1cccc(c1)C(F)(F)F)c1ccc(cn1)-c1ncccn1
: