Target
Glycogen phosphorylase, muscle form
Ligand
BDBM50382962
Substrate
Meas. Tech.
ChEMBL_818388 (CHEMBL2034615)
IC50
4000±n/a nM
Citation
 Krimm, ILancelin, JMPraly, JP Binding evaluation of fragment-based scaffolds for probing allosteric enzymes. J Med Chem 55:1287-95 (2012)  
Target
Name:
Glycogen phosphorylase, muscle form
Synonyms:
Glycogen Phosphorylase (PYGM) Glycogen phosphorylase, muscle form PYGM | PYGM_RABIT
Type:
Enzyme
Mol. Mass.:
97296.32
Organism:
Oryctolagus cuniculus (rabbit)
Description:
Phosphorylation of Ser-15 converts phosphorylase B (unphosphorylated) to phosphorylase A.
Residue:
843
  
Inhibitor
Name:
BDBM50382962
Synonyms:
CHEMBL2030479
Type:
Small organic molecule
Emp. Form.:
C16H19N3O7
Mol. Mass.:
365.338
SMILES:
OC[C@H]1O[C@@H](NC(=O)NC(=O)c2cc3ccccc3[nH]2)[C@H](O)[C@@H](O)[C@@H]1O
: