Target
Glycogen phosphorylase, muscle form
Ligand
BDBM50382963
Substrate
Meas. Tech.
ChEMBL_818388 (CHEMBL2034615)
IC50
900±n/a nM
Citation
 Krimm, ILancelin, JMPraly, JP Binding evaluation of fragment-based scaffolds for probing allosteric enzymes. J Med Chem 55:1287-95 (2012)  
Target
Name:
Glycogen phosphorylase, muscle form
Synonyms:
Glycogen Phosphorylase (PYGM) Glycogen phosphorylase, muscle form PYGM | PYGM_RABIT
Type:
Enzyme
Mol. Mass.:
97296.32
Organism:
Oryctolagus cuniculus (rabbit)
Description:
Phosphorylation of Ser-15 converts phosphorylase B (unphosphorylated) to phosphorylase A.
Residue:
843
  
Inhibitor
Name:
BDBM50382963
Synonyms:
CHEMBL2030480
Type:
Small organic molecule
Emp. Form.:
C21H16N2O6
Mol. Mass.:
392.3615
SMILES:
Nc1ccccc1C(=O)Nc1ccccc1Oc1ccc(C(O)=O)c(c1)C(O)=O
: