Target
Egl nine homolog 1
Ligand
BDBM50383012
Substrate
Meas. Tech.
ChEMBL_818439 (CHEMBL2034759)
IC50
>1000000±n/a nM
Citation
 Woon, ECDemetriades, MBagg, EAAik, WKrylova, SMMa, JHChan, MWalport, LJWegman, DWDack, KNMcDonough, MAKrylov, SNSchofield, CJ Dynamic combinatorial mass spectrometry leads to inhibitors of a 2-oxoglutarate-dependent nucleic acid demethylase. J Med Chem 55:2173-84 (2012)  
Target
Name:
Egl nine homolog 1
Synonyms:
C1orf12 EGLN1_HUMAN Hypoxia-inducible factor prolyl hydroxylase 2 (HIF-PH2) Prolyl hydroxylase domain-containing protein 2 (PHD2)
Type:
Protein
Mol. Mass.:
46035.59
Organism:
Homo sapiens (Human)
Description:
Q9GZT9
Residue:
426
  
Inhibitor
Name:
BDBM50383012
Synonyms:
CHEMBL2030872
Type:
Small organic molecule
Emp. Form.:
C16H15NO5S
Mol. Mass.:
333.359
SMILES:
OC(=O)[C@H](CSCc1ccc2ccccc2c1)NC(=O)C(O)=O
: