Target
Melanin-concentrating hormone receptor 1
Ligand
BDBM50383096
Substrate
Meas. Tech.
ChEMBL_818766 (CHEMBL2033452)
IC50
0.74±n/a nM
Citation
 Kamata, MYamashita, TImaeda, TTanaka, TMasada, SKamaura, MKasai, SHara, RSasaki, STakekawa, SAsami, AKaisho, TSuzuki, NAshina, SOgino, HNakano, YNagisa, YKato, KKato, KIshihara, Y Melanin-concentrating hormone receptor 1 antagonists. Synthesis and structure-activity relationships of novel 3-(aminomethyl)quinolines. J Med Chem 55:2353-66 (2012)  
Target
Name:
Melanin-concentrating hormone receptor 1
Synonyms:
G-protein coupled receptor 24 MCH receptor 1 MCH-R1 MCHR-1 MCHR1_HUMAN Melanin-Concentrating Hormone Receptor 1 (MCH1R) Melanin-concentrating hormone receptor 1 (MCH-1) Melanin-concentrating hormone receptor 1 (MCHR-1) SLC-1 Somatostatin receptor-like protein
Type:
G Protein-Coupled Receptor (GPCR)
Mol. Mass.:
45976.27
Organism:
Homo sapiens (Human)
Description:
Membranes from CHO-K1 cells stably expressing human MCH1R were used in assays.
Residue:
422
  
Inhibitor
Name:
BDBM50383096
Synonyms:
CHEMBL2031716
Type:
Small organic molecule
Emp. Form.:
C27H24ClN3O
Mol. Mass.:
441.952
SMILES:
Clc1ccc(cc1)-c1ccc(cc1)C(=O)Nc1ccc2cc(CN3CCCC3)cnc2c1
: