Target
Muscarinic acetylcholine receptor M3
Ligand
BDBM50158610
Substrate
Meas. Tech.
ChEMBL_818805 (CHEMBL2033491)
Ki
204±n/a nM
Citation
 Bao, XLu, SLiow, JSZoghbi, SSJenko, KJClark, DTGladding, RLInnis, RBPike, VW Radiosynthesis and evaluation of an (18)F-labeled positron emission tomography (PET) radioligand for brain histamine subtype-3 receptors based on a nonimidazole 2-aminoethylbenzofuran chemotype. J Med Chem 55:2406-15 (2012)  
Target
Name:
Muscarinic acetylcholine receptor M3
Synonyms:
ACM3_HUMAN Cholinergic, muscarinic M3 Muscarinic receptor M3 | RecName: Full=Muscarinic acetylcholine receptor M3
Type:
Enzyme
Mol. Mass.:
66151.03
Organism:
Homo sapiens (Human)
Description:
P20309
Residue:
590
  
Inhibitor
Name:
BDBM50158610
Synonyms:
(4-Fluoro-phenyl)-{2-[2-((R)-2-methyl-pyrrolidin-1-yl)-ethyl]-benzofuran-5-yl}-methanone | CHEMBL555146
Type:
Small organic molecule
Emp. Form.:
C22H22FNO2
Mol. Mass.:
351.414
SMILES:
C[C@@H]1CCCN1CCc1cc2cc(ccc2o1)C(=O)c1ccc(F)cc1
: