Target
Transient receptor potential cation channel subfamily M member 8
Ligand
BDBM50383252
Substrate
Meas. Tech.
ChEMBL_819359 (CHEMBL2032922)
IC50
93±n/a nM
Citation
 Tamayo, NABo, YGore, VMa, VNishimura, NTang, PDeng, HKlionsky, LLehto, SGWang, WYoungblood, BChen, JCorrell, TLBartberger, MDGavva, NRNorman, MH Fused piperidines as a novel class of potent and orally available transient receptor potential melastatin type 8 (TRPM8) antagonists. J Med Chem 55:1593-611 (2012)  
Target
Name:
Transient receptor potential cation channel subfamily M member 8
Synonyms:
Cmr1 Transient receptor potential M8 protein (TRPM8) Trpm8
Type:
Enzyme
Mol. Mass.:
127633.53
Organism:
Rattus norvegicus (Rat)
Description:
Q8R455
Residue:
1104
  
Inhibitor
Name:
BDBM50383252
Synonyms:
CHEMBL2032199
Type:
Small organic molecule
Emp. Form.:
C20H15F4N3OS
Mol. Mass.:
421.411
SMILES:
Fc1ccc(NC(=O)N2CCc3scnc3C2c2ccc(cc2)C(F)(F)F)cc1
: