Target
Metabotropic glutamate receptor 2
Ligand
BDBM50383366
Substrate
Meas. Tech.
ChEMBL_820157 (CHEMBL2033868)
EC50
316±n/a nM
Citation
 Cid, JMDuvey, GTresadern, GNhem, VFurnari, RCluzeau, PVega, JAde Lucas, AIMatesanz, EAlonso, JMLinares, MLAndrés, JIPoli, SMLutjens, RHimogai, HRocher, JPMacdonald, GJOehlrich, DLavreysen, HAhnaou, ADrinkenburg, WMackie, CTrabanco, AA Discovery of 1,4-disubstituted 3-cyano-2-pyridones: a new class of positive allosteric modulators of the metabotropic glutamate 2 receptor. J Med Chem 55:2388-405 (2012)  
Target
Name:
Metabotropic glutamate receptor 2
Synonyms:
GPRC1B GRM2_HUMAN Metabotropic glutamate receptor mGlu2 | metabotropic glutamate 2
Type:
Enzyme
Mol. Mass.:
95584.88
Organism:
Homo sapiens (Human)
Description:
Q14416
Residue:
872
  
Inhibitor
Name:
BDBM50383366
Synonyms:
CHEMBL2029821
Type:
Small organic molecule
Emp. Form.:
C22H20FN3O2
Mol. Mass.:
377.4115
SMILES:
CCCCn1ccc(-c2ccc(Oc3ccnc(C)c3)c(F)c2)c(C#N)c1=O
: