Target
Melanin-concentrating hormone receptor 1
Ligand
BDBM50358743
Substrate
Meas. Tech.
ChEMBL_818498 (CHEMBL2032590)
IC50
0.5±n/a nM
Citation
 Mihalic, JTFan, PChen, XChen, XFu, YMotani, ALiang, LLindstrom, MTang, LChen, JLJaen, JDai, KLi, L Discovery of a novel melanin concentrating hormone receptor 1 (MCHR1) antagonist with reduced hERG inhibition. Bioorg Med Chem Lett 22:3781-5 (2012)  
Target
Name:
Melanin-concentrating hormone receptor 1
Synonyms:
G-protein coupled receptor 24 MCH receptor 1 MCH-R1 MCHR-1 MCHR1_HUMAN Melanin-Concentrating Hormone Receptor 1 (MCH1R) Melanin-concentrating hormone receptor 1 (MCH-1) Melanin-concentrating hormone receptor 1 (MCHR-1) SLC-1 Somatostatin receptor-like protein
Type:
G Protein-Coupled Receptor (GPCR)
Mol. Mass.:
45976.27
Organism:
Homo sapiens (Human)
Description:
Membranes from CHO-K1 cells stably expressing human MCH1R were used in assays.
Residue:
422
  
Inhibitor
Name:
BDBM50358743
Synonyms:
CHEMBL1922270
Type:
Small organic molecule
Emp. Form.:
C25H33F3N2O
Mol. Mass.:
434.5375
SMILES:
C[C@@H]1[C@H]2CN(CCCC3CCOCC3)CC[C@@H]2Cc2[nH]c3ccc(cc3c12)C(F)(F)F
: