Target
Alpha-2C adrenergic receptor
Ligand
BDBM50383522
Substrate
Meas. Tech.
ChEMBL_818585 (CHEMBL2032872)
Ki
>2000±n/a nM
Citation
 Mihalic, JTFan, PChen, XChen, XFu, YMotani, ALiang, LLindstrom, MTang, LChen, JLJaen, JDai, KLi, L Discovery of a novel melanin concentrating hormone receptor 1 (MCHR1) antagonist with reduced hERG inhibition. Bioorg Med Chem Lett 22:3781-5 (2012)  
Target
Name:
Alpha-2C adrenergic receptor
Synonyms:
ADA2C_HUMAN ADRA2L2 Adrenergic alpha2C Adrenergic receptor alpha Alpha-2 adrenergic receptor subtype C4 Alpha-2C adrenoreceptor | adrenergic, alpha-2C-, receptor [Homo sapiens]
Type:
Enzyme
Mol. Mass.:
49552.32
Organism:
Homo sapiens (Human)
Description:
P18825
Residue:
462
  
Inhibitor
Name:
BDBM50383522
Synonyms:
CHEMBL2032049
Type:
Small organic molecule
Emp. Form.:
C26H33F3N2O2
Mol. Mass.:
462.5476
SMILES:
C[C@@H]1[C@H]2CN(CCC3(CCCCC3)C(O)=O)CC[C@@H]2Cc2[nH]c3ccc(cc3c12)C(F)(F)F
: