Target
Voltage-dependent N-type calcium channel subunit alpha-1B
Ligand
BDBM50383772
Substrate
Meas. Tech.
ChEMBL_819282 (CHEMBL2032639)
IC50
3000±n/a nM
Citation
 Yamamoto, TNiwa, STokumasu, MOnishi, TOhno, SHagihara, MKoganei, HFujita, STakeda, TSaitou, YIwayama, STakahara, AIwata, SShoji, M Discovery and evaluation of selective N-type calcium channel blockers: 6-unsubstituted-1,4-dihydropyridine-5-carboxylic acid derivatives. Bioorg Med Chem Lett 22:3639-42 (2012)  
Target
Name:
Voltage-dependent N-type calcium channel subunit alpha-1B
Synonyms:
BIII CAC1B_HUMAN CACNA1B Calcium channel (Type N) Voltage-dependent N-type calcium channel subunit alpha-1B Voltage-gated N-type calcium channel alpha-1B subunit Voltage-gated calcium channel Voltage-gated calcium channel subunit alpha Cav2.2 ((alpha 1B, beta 1b, alpha 2 delta-1) | calcium channel, voltage-dependent, N type, alpha 1B subunit
Type:
Enzyme
Mol. Mass.:
262548.16
Organism:
Homo sapiens (Human)
Description:
Q00975
Residue:
2339
  
Inhibitor
Name:
BDBM50383772
Synonyms:
CHEMBL451812
Type:
Small organic molecule
Emp. Form.:
C26H26ClNO6
Mol. Mass.:
483.941
SMILES:
COC(OC)C1=C(C(C(C(O)=O)C(C)=N1)c1cccc(Cl)c1)C(=O)OC\C=C\c1ccccc1
: