Target
Beta-secretase 1
Ligand
BDBM50383837
Substrate
Meas. Tech.
ChEMBL_819409 (CHEMBL2033076)
IC50
7±n/a nM
Citation
 Monenschein, HHorne, DBBartberger, MDHitchcock, SANguyen, TTPatel, VFPennington, LDZhong, W Structure guided P1' modifications of HEA derivedß-secretase inhibitors for the treatment of Alzheimer's disease. Bioorg Med Chem Lett 22:3607-11 (2012)  
Target
Name:
Beta-secretase 1
Synonyms:
ASP2 Aspartyl protease 2 BACE1 Beta-secretase (BACE) Beta-secretase 1 (BACE 1) Beta-secretase 1 (BACE1) Beta-site amyloid precursor protein cleaving enzyme 1 Memapsin-2 beta-Secretase (BACE-1) | beta-Secretase (BACE1)
Type:
Protein
Mol. Mass.:
55755.10
Organism:
Homo sapiens (Human)
Description:
P56817
Residue:
501
  
Inhibitor
Name:
BDBM50383837
Synonyms:
CHEMBL2030998
Type:
Small organic molecule
Emp. Form.:
C28H37F2N3O3
Mol. Mass.:
501.6085
SMILES:
CC(=O)N[C@@H](Cc1cc(F)cc(F)c1)[C@H](O)CN[C@H]1CC2(CCC2)Oc2ncc(CC(C)(C)C)cc12
: