Target
Cathepsin D
Ligand
BDBM50383838
Substrate
Meas. Tech.
ChEMBL_819410 (CHEMBL2033077)
IC50
4±n/a nM
Citation
 Monenschein, HHorne, DBBartberger, MDHitchcock, SANguyen, TTPatel, VFPennington, LDZhong, W Structure guided P1' modifications of HEA derivedß-secretase inhibitors for the treatment of Alzheimer's disease. Bioorg Med Chem Lett 22:3607-11 (2012)  
Target
Name:
Cathepsin D
Synonyms:
CATD_HUMAN CTSD Cathepsin D heavy chain Cathepsin D precursor
Type:
Enzyme
Mol. Mass.:
44551.72
Organism:
Homo sapiens (Human)
Description:
Human proCathepsin D (SwissProt accession number P07339) was expressed in Sf9 cells, purified, and autoactivated.
Residue:
412
  
Inhibitor
Name:
BDBM50383838
Synonyms:
CHEMBL2030996
Type:
Small organic molecule
Emp. Form.:
C28H38FN3O3
Mol. Mass.:
483.618
SMILES:
CC(=O)N[C@@H](Cc1cccc(F)c1)[C@H](O)CN[C@H]1CC2(CCC2)Oc2ncc(CC(C)(C)C)cc12
: