Target
Peptide deformylase
Ligand
BDBM50383991
Substrate
Meas. Tech.
ChEMBL_819737 (CHEMBL2034167)
IC50
0.91±n/a nM
Citation
 Axten, JMMedina, JRBlackledge, CWDuquenne, CGrant, SWBobko, MAPeng, TMiller, WHPinckney, TGallagher, TFKulkarni, SLewandowski, TVan Aller, GSZonis, RWard, PCampobasso, N Acylprolinamides: a new class of peptide deformylase inhibitors with in vivo antibacterial activity. Bioorg Med Chem Lett 22:4028-32 (2012)  
Target
Name:
Peptide deformylase
Synonyms:
DEF_STRPN Polypeptide deformylase | def
Type:
PROTEIN
Mol. Mass.:
22668.24
Organism:
Streptococcus pneumoniae serotype 4 (strain ATCC BAA-334 / TIGR4)
Description:
ChEMBL_819737
Residue:
203
  
Inhibitor
Name:
BDBM50383991
Synonyms:
CHEMBL2029376
Type:
Small organic molecule
Emp. Form.:
C16H26N4O5
Mol. Mass.:
354.4014
SMILES:
NC(=O)NC(=O)[C@@H]1CCCN1C(=O)[C@H](CC1CCCC1)CN(O)C=O
: