Target
Membrane primary amine oxidase
Ligand
BDBM50384083
Substrate
Meas. Tech.
ChEMBL_819788 (CHEMBL2034300)
IC50
20±n/a nM
Citation
 Foot, JSDeodhar, MTurner, CIYin, Pvan Dam, EMSilva, DGOlivieri, AHolt, AMcDonald, IA The discovery and development of selective 3-fluoro-4-aryloxyallylamine inhibitors of the amine oxidase activity of semicarbazide-sensitive amine oxidase/vascular adhesion protein-1 (SSAO/VAP-1). Bioorg Med Chem Lett 22:3935-40 (2012)  
Target
Name:
Membrane primary amine oxidase
Synonyms:
AOC3 Amine oxidase, copper containing Semicarbazide-sensitive amine oxidase/ Vascular adhesion protein 1 (SSAO/VAP-1) Vascular adhesion protein 1 (VAP-1)
Type:
Protein
Mol. Mass.:
84620.86
Organism:
Homo sapiens (Human)
Description:
Q16853
Residue:
763
  
Inhibitor
Name:
BDBM50384083
Synonyms:
CHEMBL2029545
Type:
Small organic molecule
Emp. Form.:
C16H21FN2O2
Mol. Mass.:
292.3485
SMILES:
NC\C=C(\F)COc1ccc(cc1)C(=O)NC1CCCC1
: