Target
Histamine H3 receptor
Ligand
BDBM50384403
Substrate
Meas. Tech.
ChEMBL_818346 (CHEMBL2034483)
Ki
23±n/a nM
Citation
 Josef, KAAimone, LDLyons, JRaddatz, RHudkins, RL Synthesis of constrained benzocinnolinone analogues of CEP-26401 (irdabisant) as potent, selective histamine H3 receptor inverse agonists. Bioorg Med Chem Lett 22:4198-202 (2012)  
Target
Name:
Histamine H3 receptor
Synonyms:
HH3R Hrh3
Type:
G Protein-Coupled Receptor (GPCR)
Mol. Mass.:
48607.98
Organism:
Rattus norvegicus (rat)
Description:
Residue:
445
  
Inhibitor
Name:
BDBM50384403
Synonyms:
CHEMBL2031472
Type:
Small organic molecule
Emp. Form.:
C26H29N3O2
Mol. Mass.:
415.5274
SMILES:
C[C@@H]1CCCN1CCCOc1ccc-2c(CCc3cc(=O)n(nc-23)-c2ccccc2)c1
: