Target
Histamine H3 receptor
Ligand
BDBM50384404
Substrate
Meas. Tech.
ChEMBL_818346 (CHEMBL2034483)
Ki
140±n/a nM
Citation
 Josef, KAAimone, LDLyons, JRaddatz, RHudkins, RL Synthesis of constrained benzocinnolinone analogues of CEP-26401 (irdabisant) as potent, selective histamine H3 receptor inverse agonists. Bioorg Med Chem Lett 22:4198-202 (2012)  
Target
Name:
Histamine H3 receptor
Synonyms:
HH3R Hrh3
Type:
G Protein-Coupled Receptor (GPCR)
Mol. Mass.:
48607.98
Organism:
Rattus norvegicus (rat)
Description:
Residue:
445
  
Inhibitor
Name:
BDBM50384404
Synonyms:
CHEMBL2031473
Type:
Small organic molecule
Emp. Form.:
C27H31N3O2
Mol. Mass.:
429.5539
SMILES:
O=c1cc2CCc3cc(OCCCN4CCCCC4)ccc3-c2nn1Cc1ccccc1
: