Target
Cytochrome P450 2C8
Ligand
BDBM50384467
Substrate
Meas. Tech.
ChEMBL_821903 (CHEMBL2039549)
IC50
43±n/a nM
Citation
 Crosignani, SJorand-Lebrun, CCampbell, GPrêtre, AGrippi-Vallotton, TQuattropani, ABouscary-Desforges, GBombrun, AMissotten, MHumbert, YFrémaux, CPâquet, MEl Harkani, KBradshaw, CGCleva, CAbla, NDaff, HSchott, OPittet, PAArrighi, JFGaudet, MJohnson, Z Discovery of a Novel Series of CRTH2 (DP2) Receptor Antagonists Devoid of Carboxylic Acids. ACS Med Chem Lett 2:938-942 (2011)  
Target
Name:
Cytochrome P450 2C8
Synonyms:
CP2C8_HUMAN CYPIIC8 P450 IIC2 P450 form 1 | S-mephenytoin 4-hydroxylase
Type:
Protein
Mol. Mass.:
55839.23
Organism:
Homo sapiens (Human)
Description:
P10632
Residue:
490
  
Inhibitor
Name:
BDBM50384467
Synonyms:
CHEMBL2036213
Type:
Small organic molecule
Emp. Form.:
C18H15F4N5O2
Mol. Mass.:
409.3376
SMILES:
CCC(=O)N(Cc1ccc(OC(F)(F)F)cc1)c1cc(F)cc(c1)-c1nnn[nH]1
: