Target
Cytochrome P450 2C9
Ligand
BDBM50384475
Substrate
Meas. Tech.
ChEMBL_821904 (CHEMBL2039550)
IC50
290±n/a nM
Citation
 Crosignani, SJorand-Lebrun, CCampbell, GPrêtre, AGrippi-Vallotton, TQuattropani, ABouscary-Desforges, GBombrun, AMissotten, MHumbert, YFrémaux, CPâquet, MEl Harkani, KBradshaw, CGCleva, CAbla, NDaff, HSchott, OPittet, PAArrighi, JFGaudet, MJohnson, Z Discovery of a Novel Series of CRTH2 (DP2) Receptor Antagonists Devoid of Carboxylic Acids. ACS Med Chem Lett 2:938-942 (2011)  
Target
Name:
Cytochrome P450 2C9
Synonyms:
(R)-limonene 6-monooxygenase CP2C9_HUMAN CYP2C9 Cytochrome P450 2C9 (CYP2C9 ) P-450MP P450 PB-1 | S-mephenytoin 4-hydroxylase
Type:
Enzyme
Mol. Mass.:
55636.33
Organism:
Homo sapiens (Human)
Description:
P11712
Residue:
490
  
Inhibitor
Name:
BDBM50384475
Synonyms:
CHEMBL2036225
Type:
Small organic molecule
Emp. Form.:
C23H20FN5O3S
Mol. Mass.:
465.5
SMILES:
CS(=O)(=O)c1ccc(CN(C(=O)Cc2ccccc2)c2cc(F)cc(c2)-c2nnn[nH]2)cc1
: