Target
Cytochrome P450 3A4
Ligand
BDBM50384466
Substrate
Meas. Tech.
ChEMBL_821901 (CHEMBL2039547)
IC50
>10000±n/a nM
Citation
 Crosignani, SJorand-Lebrun, CCampbell, GPrêtre, AGrippi-Vallotton, TQuattropani, ABouscary-Desforges, GBombrun, AMissotten, MHumbert, YFrémaux, CPâquet, MEl Harkani, KBradshaw, CGCleva, CAbla, NDaff, HSchott, OPittet, PAArrighi, JFGaudet, MJohnson, Z Discovery of a Novel Series of CRTH2 (DP2) Receptor Antagonists Devoid of Carboxylic Acids. ACS Med Chem Lett 2:938-942 (2011)  
Target
Name:
Cytochrome P450 3A4
Synonyms:
Albendazole monooxygenase CP3A4_HUMAN CYP3A4 CYPIIIA4 Cytochrome P450 3A4 (CYP3A4) Nifedipine oxidase Taurochenodeoxycholate 6-alpha-hydroxylase
Type:
Enzyme
Mol. Mass.:
57349.57
Organism:
Homo sapiens (Human)
Description:
Residue:
503
  
Inhibitor
Name:
BDBM50384466
Synonyms:
CHEMBL2036212
Type:
Small organic molecule
Emp. Form.:
C20H19F4N5O2
Mol. Mass.:
437.3908
SMILES:
CCCCC(=O)N(Cc1cccc(OC(F)(F)F)c1)c1cc(F)cc(c1)-c1nnn[nH]1
: