Target
Tyrosine-protein kinase receptor UFO
Ligand
BDBM50384605
Substrate
Meas. Tech.
ChEMBL_820660 (CHEMBL2037931)
IC50
360±n/a nM
Citation
 Liu, JYang, CSimpson, CDeryckere, DVan Deusen, AMiley, MJKireev, DNorris-Drouin, JSather, SHunter, DKorboukh, VKPatel, HSJanzen, WPMachius, MJohnson, GLEarp, HSGraham, DKFrye, SVWang, X Discovery of Novel Small Molecule Mer Kinase Inhibitors for the Treatment of Pediatric Acute Lymphoblastic Leukemia. ACS Med Chem Lett 3:129-134 (2012)  
Target
Name:
Tyrosine-protein kinase receptor UFO
Synonyms:
AXL TEL/AXL UFO | UFO_HUMAN
Type:
Enzyme
Mol. Mass.:
98316.97
Organism:
Homo sapiens (Human)
Description:
P30530
Residue:
894
  
Inhibitor
Name:
BDBM50384605
Synonyms:
CHEMBL2036798 | US9744172, Compound UNC00000465A
Type:
Small organic molecule
Emp. Form.:
C22H28N6
Mol. Mass.:
376.4979
SMILES:
NC1CCC(Cn2nc(-c3ccccc3)c3cnc(NC4CCC4)nc23)CC1
: