Target
Tyrosine-protein kinase receptor TYRO3
Ligand
BDBM50384603
Substrate
Meas. Tech.
ChEMBL_820661 (CHEMBL2037932)
IC50
77±n/a nM
Citation
 Liu, JYang, CSimpson, CDeryckere, DVan Deusen, AMiley, MJKireev, DNorris-Drouin, JSather, SHunter, DKorboukh, VKPatel, HSJanzen, WPMachius, MJohnson, GLEarp, HSGraham, DKFrye, SVWang, X Discovery of Novel Small Molecule Mer Kinase Inhibitors for the Treatment of Pediatric Acute Lymphoblastic Leukemia. ACS Med Chem Lett 3:129-134 (2012)  
Target
Name:
Tyrosine-protein kinase receptor TYRO3
Synonyms:
BYK RSE TIF TYRO3_HUMAN | Tyrosine-protein kinase SKY
Type:
Protein
Mol. Mass.:
96894.13
Organism:
Homo sapiens (Human)
Description:
Q06418
Residue:
890
  
Inhibitor
Name:
BDBM50384603
Synonyms:
CHEMBL2036796 | US9744172, Compound UNC00000463A
Type:
Small organic molecule
Emp. Form.:
C23H32N6
Mol. Mass.:
392.5404
SMILES:
CCCCCNc1ncc2c(nn(CC3CCC(N)CC3)c2n1)-c1ccccc1
: