Target
Serine/threonine-protein kinase Chk1
Ligand
BDBM50384667
Substrate
Meas. Tech.
ChEMBL_820799 (CHEMBL2038357)
IC50
86±n/a nM
Citation
 Huang, XCheng, CCFischmann, TODuca, JSYang, XRichards, MShipps, GW Discovery of a Novel Series of CHK1 Kinase Inhibitors with a Distinctive Hinge Binding Mode. ACS Med Chem Lett 3:123-128 (2012)  
Target
Name:
Serine/threonine-protein kinase Chk1
Synonyms:
CHEK1 CHK1 checkpoint homolog Checkpoint kinase-1 (CHK1)
Type:
Enzyme Catalytic Domain
Mol. Mass.:
54443.02
Organism:
Homo sapiens (Human)
Description:
gi_166295192
Residue:
476
  
Inhibitor
Name:
BDBM50384667
Synonyms:
CHEMBL2037025
Type:
Small organic molecule
Emp. Form.:
C23H24N4O2S
Mol. Mass.:
420.527
SMILES:
C[C@H]1CN(CCN1)c1ccccc1NC(=O)c1csc(n1)-c1ccc2OCCc2c1
: