Target
BDNF/NT-3 growth factors receptor
Ligand
BDBM50384724
Substrate
Meas. Tech.
ChEMBL_820920 (CHEMBL2038861)
IC50
19±n/a nM
Citation
 Albaugh, PFan, YMi, YSun, FAdrian, FLi, NJia, YSarkisova, YKreusch, AHood, TLu, MLiu, GHuang, SLiu, ZLoren, JTuntland, TKaranewsky, DSSeidel, HMMolteni, V Discovery of GNF-5837, a Selective TRK Inhibitor with Efficacy in Rodent Cancer Tumor Models. ACS Med Chem Lett 3:140-145 (2012)  
Target
Name:
BDNF/NT-3 growth factors receptor
Synonyms:
GP145-TrkB NTRK2 Neurotrophic tyrosine kinase receptor type 2 Trk-B Tropomyosin-related kinase B Tyrosine kinase receptor B (Trk-B)
Type:
Enzyme
Mol. Mass.:
91996.87
Organism:
Homo sapiens (Human)
Description:
Q16620
Residue:
822
  
Inhibitor
Name:
BDBM50384724
Synonyms:
CHEMBL2037221
Type:
Small organic molecule
Emp. Form.:
C39H43F3N8O3
Mol. Mass.:
728.8057
SMILES:
CCN(CC)CCNC(=O)c1c[nH]c(\C=C2/C(=O)Nc3cc(Nc4cccc(NC(=O)c5cc(cc(c5)C(F)(F)F)N5CCN(C)CC5)c4)ccc23)c1
: