Target
Mitogen-activated protein kinase 9
Ligand
BDBM50384725
Substrate
Meas. Tech.
ChEMBL_820936 (CHEMBL2038981)
IC50
5800±n/a nM
Citation
 Albaugh, PFan, YMi, YSun, FAdrian, FLi, NJia, YSarkisova, YKreusch, AHood, TLu, MLiu, GHuang, SLiu, ZLoren, JTuntland, TKaranewsky, DSSeidel, HMMolteni, V Discovery of GNF-5837, a Selective TRK Inhibitor with Efficacy in Rodent Cancer Tumor Models. ACS Med Chem Lett 3:140-145 (2012)  
Target
Name:
Mitogen-activated protein kinase 9
Synonyms:
JNK1/JNK2 MAP kinase 9 MK09_MOUSE Mitogen-activated protein kinase 9 Stress-activated protein kinase JNK2 | c-Jun N-terminal kinase 2
Type:
PROTEIN
Mol. Mass.:
48184.13
Organism:
Mus musculus
Description:
ChEMBL_820936
Residue:
423
  
Inhibitor
Name:
BDBM50384725
Synonyms:
CHEMBL2037209
Type:
Small organic molecule
Emp. Form.:
C31H23F3N6O2
Mol. Mass.:
568.5485
SMILES:
Cc1cn(cn1)-c1cc(cc(c1)C(F)(F)F)C(=O)Nc1cccc(Nc2ccc3\C(=C\c4ccc[nH]4)C(=O)Nc3c2)c1
: