Target
Mitogen-activated protein kinase 9
Ligand
BDBM50384727
Substrate
Meas. Tech.
ChEMBL_820936 (CHEMBL2038981)
IC50
2900±n/a nM
Citation
 Albaugh, PFan, YMi, YSun, FAdrian, FLi, NJia, YSarkisova, YKreusch, AHood, TLu, MLiu, GHuang, SLiu, ZLoren, JTuntland, TKaranewsky, DSSeidel, HMMolteni, V Discovery of GNF-5837, a Selective TRK Inhibitor with Efficacy in Rodent Cancer Tumor Models. ACS Med Chem Lett 3:140-145 (2012)  
Target
Name:
Mitogen-activated protein kinase 9
Synonyms:
JNK1/JNK2 MAP kinase 9 MK09_MOUSE Mitogen-activated protein kinase 9 Stress-activated protein kinase JNK2 | c-Jun N-terminal kinase 2
Type:
PROTEIN
Mol. Mass.:
48184.13
Organism:
Mus musculus
Description:
ChEMBL_820936
Residue:
423
  
Inhibitor
Name:
BDBM50384727
Synonyms:
CHEMBL2037226
Type:
Small organic molecule
Emp. Form.:
C28H21F4N5O2
Mol. Mass.:
535.4923
SMILES:
Cc1ccc(NC(=O)Nc2cc(ccc2F)C(F)(F)F)cc1Nc1ccc2\C(=C\c3ccc[nH]3)C(=O)Nc2c1
: