Target
Vascular endothelial growth factor receptor 1
Ligand
BDBM50384727
Substrate
Meas. Tech.
ChEMBL_820931 (CHEMBL2038872)
IC50
4400±n/a nM
Citation
 Albaugh, PFan, YMi, YSun, FAdrian, FLi, NJia, YSarkisova, YKreusch, AHood, TLu, MLiu, GHuang, SLiu, ZLoren, JTuntland, TKaranewsky, DSSeidel, HMMolteni, V Discovery of GNF-5837, a Selective TRK Inhibitor with Efficacy in Rodent Cancer Tumor Models. ACS Med Chem Lett 3:140-145 (2012)  
Target
Name:
Vascular endothelial growth factor receptor 1
Synonyms:
Emrk2 Flt1 Vegfr1
Type:
PROTEIN
Mol. Mass.:
149906.69
Organism:
Mus musculus
Description:
ChEMBL_820931
Residue:
1333
  
Inhibitor
Name:
BDBM50384727
Synonyms:
CHEMBL2037226
Type:
Small organic molecule
Emp. Form.:
C28H21F4N5O2
Mol. Mass.:
535.4923
SMILES:
Cc1ccc(NC(=O)Nc2cc(ccc2F)C(F)(F)F)cc1Nc1ccc2\C(=C\c3ccc[nH]3)C(=O)Nc2c1
: