Target
Fibroblast growth factor receptor 3
Ligand
BDBM50384727
Substrate
Meas. Tech.
ChEMBL_820928 (CHEMBL2038869)
IC50
9300±n/a nM
Citation
 Albaugh, PFan, YMi, YSun, FAdrian, FLi, NJia, YSarkisova, YKreusch, AHood, TLu, MLiu, GHuang, SLiu, ZLoren, JTuntland, TKaranewsky, DSSeidel, HMMolteni, V Discovery of GNF-5837, a Selective TRK Inhibitor with Efficacy in Rodent Cancer Tumor Models. ACS Med Chem Lett 3:140-145 (2012)  
Target
Name:
Fibroblast growth factor receptor 3
Synonyms:
FGFR3_MOUSE Fibroblast growth factor receptor Mfr3 | Sam3
Type:
PROTEIN
Mol. Mass.:
87753.47
Organism:
Mus musculus
Description:
ChEMBL_820928
Residue:
801
  
Inhibitor
Name:
BDBM50384727
Synonyms:
CHEMBL2037226
Type:
Small organic molecule
Emp. Form.:
C28H21F4N5O2
Mol. Mass.:
535.4923
SMILES:
Cc1ccc(NC(=O)Nc2cc(ccc2F)C(F)(F)F)cc1Nc1ccc2\C(=C\c3ccc[nH]3)C(=O)Nc2c1
: