Target
Regulator of G-protein signaling 8
Ligand
BDBM50384750
Substrate
Meas. Tech.
ChEMBL_821036 (CHEMBL2039223)
IC50
10900±n/a nM
Citation
 Turner, EMBlazer, LLNeubig, RRHusbands, SM Small Molecule Inhibitors of Regulator of G Protein Signalling (RGS) Proteins. ACS Med Chem Lett 3:146-150 (2012)  
Target
Name:
Regulator of G-protein signaling 8
Synonyms:
RGS8 Regulator of G-protein signaling 8 (RGS8)
Type:
Enzyme Catalytic Domain
Mol. Mass.:
20925.80
Organism:
Homo sapiens (Human)
Description:
gi_74355113
Residue:
180
  
Inhibitor
Name:
BDBM50384750
Synonyms:
CHEMBL2037349
Type:
Small organic molecule
Emp. Form.:
C15H11ClN2O2S
Mol. Mass.:
318.778
SMILES:
Clc1cccc(c1)-n1sc(=O)n(Cc2ccccc2)c1=O
: