Target
Regulator of G-protein signaling 4
Ligand
BDBM50384750
Substrate
Meas. Tech.
ChEMBL_821035 (CHEMBL2039222)
IC50
33±n/a nM
Citation
 Turner, EMBlazer, LLNeubig, RRHusbands, SM Small Molecule Inhibitors of Regulator of G Protein Signalling (RGS) Proteins. ACS Med Chem Lett 3:146-150 (2012)  
Target
Name:
Regulator of G-protein signaling 4
Synonyms:
RGP4 RGS4_HUMAN | Regulator of G-protein signaling 4 (RGS4)
Type:
Enzyme
Mol. Mass.:
23263.51
Organism:
Homo sapiens (Human)
Description:
P49798
Residue:
205
  
Inhibitor
Name:
BDBM50384750
Synonyms:
CHEMBL2037349
Type:
Small organic molecule
Emp. Form.:
C15H11ClN2O2S
Mol. Mass.:
318.778
SMILES:
Clc1cccc(c1)-n1sc(=O)n(Cc2ccccc2)c1=O
: