Target
Regulator of G-protein signaling 4
Ligand
BDBM50384759
Substrate
Meas. Tech.
ChEMBL_821035 (CHEMBL2039222)
IC50
34±n/a nM
Citation
 Turner, EMBlazer, LLNeubig, RRHusbands, SM Small Molecule Inhibitors of Regulator of G Protein Signalling (RGS) Proteins. ACS Med Chem Lett 3:146-150 (2012)  
Target
Name:
Regulator of G-protein signaling 4
Synonyms:
RGP4 RGS4_HUMAN | Regulator of G-protein signaling 4 (RGS4)
Type:
Enzyme
Mol. Mass.:
23263.51
Organism:
Homo sapiens (Human)
Description:
P49798
Residue:
205
  
Inhibitor
Name:
BDBM50384759
Synonyms:
CHEMBL2037356
Type:
Small organic molecule
Emp. Form.:
C16H12Cl2N2O2S
Mol. Mass.:
367.25
SMILES:
Cc1ccc(cc1)-n1sc(=O)n(Cc2ccc(Cl)c(Cl)c2)c1=O
: