Target
Vasopressin V1a receptor
Ligand
BDBM50384820
Substrate
Meas. Tech.
ChEMBL_821173 (CHEMBL2039715)
Ki
>6309.57±n/a nM
Citation
 Borthwick, ADLiddle, JDavies, DEExall, AMHamlett, CHickey, DMMason, AMSmith, IENerozzi, FPeace, SPollard, DSollis, SLAllen, MJWoollard, PMPullen, MAWestfall, TDStanislaus, DJ Pyridyl-2,5-diketopiperazines as potent, selective, and orally bioavailable oxytocin antagonists: synthesis, pharmacokinetics, and in vivo potency. J Med Chem 55:783-96 (2012)  
Target
Name:
Vasopressin V1a receptor
Synonyms:
AVPR V1a AVPR1A V1AR_HUMAN VASOPRESSIN V1A Vasopressin V1 receptor Vasopressin receptor
Type:
Receptor
Mol. Mass.:
46820.18
Organism:
Homo sapiens (Human)
Description:
P37288
Residue:
418
  
Inhibitor
Name:
BDBM50384820
Synonyms:
EPELSIBAN | GSK557296B
Type:
Small organic molecule
Emp. Form.:
C30H38N4O4
Mol. Mass.:
518.6471
SMILES:
CC[C@H](C)[C@H]1N([C@@H](C(=O)N2CCOCC2)c2ccc(C)nc2C)C(=O)[C@H](NC1=O)C1Cc2ccccc2C1
: