Target
Receptor-type tyrosine-protein kinase FLT3
Ligand
BDBM50384888
Substrate
Meas. Tech.
ChEMBL_821813 (CHEMBL2039257)
IC50
>3000±n/a nM
Citation
 Cha, MYLee, KOKang, SJJung, YHSong, JYChoi, KJByun, JYLee, HJLee, GSPark, SBKim, MS Synthesis and biological evaluation of pyrimidine-based dual inhibitors of human epidermal growth factor receptor 1 (HER-1) and HER-2 tyrosine kinases. J Med Chem 55:2846-57 (2012)  
Target
Name:
Receptor-type tyrosine-protein kinase FLT3
Synonyms:
CD135 FL cytokine receptor FLK2 FLT3 Fetal liver kinase-2 Fms-like tyrosine kinase 3 (Flt-3) STK-1 Stem cell tyrosine kinase 1
Type:
Enzyme
Mol. Mass.:
112888.62
Organism:
Homo sapiens (Human)
Description:
P36888
Residue:
993
  
Inhibitor
Name:
BDBM50384888
Synonyms:
CHEMBL2035810
Type:
Small organic molecule
Emp. Form.:
C23H20ClN7O3
Mol. Mass.:
477.903
SMILES:
Nc1ncnc(Nc2ccc(OCc3ccccn3)c(Cl)c2)c1-c1nc(CNC(=O)C=C)co1
: